{"text_format":"1","workbook":"xlsx","n_sheets":4,"sheets":["Rekenblad","Gemeenten met categorie","Invoerscherm","INFO"],"not_rendered":{"charts":0,"images":1,"macros":1,"external_links":0,"defined_names":7,"comments":0,"pivot_tables":0},"unopened":[],"bounds":{"document_bytes":16777216,"sheet_cells":100000,"rows_first":2000,"rows_last":500,"rows_between":2000,"halvings":0,"cell_chars":16384,"cell_head_chars":4096},"cells_cut":0,"cells_raw":0,"read":"whole","date_system":"1900"}

{"sheet":"Rekenblad","index":0,"n_rows":82,"n_cols":15,"rows_kept":82,"cut":false,"hidden":false,"merged":[[80,1,80,11],[12,3,12,4],[9,3,9,6],[13,3,13,4],[10,3,10,4],[10,5,10,6],[55,3,55,4],[39,3,39,4],[41,0,41,2],[42,3,42,4],[54,1,54,2],[60,1,60,2],[58,1,58,2],[57,1,57,2],[68,0,69,0],[68,1,68,2],[63,0,64,0],[65,1,65,2],[69,1,69,2],[64,1,64,2],[66,1,66,2],[59,1,59,2],[45,1,45,2],[46,3,46,4],[4,11,4,12],[2,13,2,14],[4,13,4,14],[2,1,2,3],[2,5,2,10],[3,1,3,10],[4,1,4,10],[3,12,3,14],[2,11,2,12],[38,13,38,14],[39,13,39,14],[40,13,40,14],[24,10,24,11],[49,3,49,4],[45,3,45,4],[50,3,50,4],[46,1,46,2],[5,13,5,14],[5,11,5,12],[5,5,5,10],[13,8,13,12],[11,5,11,6],[9,8,9,12],[10,8,11,12],[10,13,11,14],[12,8,12,12],[28,10,28,11],[12,13,12,14],[14,13,15,14],[16,13,17,14],[13,13,13,14],[27,10,27,11],[20,8,20,11],[21,8,22,9],[21,10,22,11],[27,8,27,9],[14,8,15,12],[16,8,17,12],[18,7,18,12],[21,5,22,7],[18,5,18,6],[14,7,15,7],[16,7,17,7],[23,8,23,9],[23,10,23,11],[24,8,24,9],[26,8,26,9],[25,10,25,11],[25,8,25,9],[26,10,26,11],[18,13,18,14],[64,13,64,14],[68,13,68,14],[66,13,66,14],[71,13,71,14],[67,13,67,14],[70,13,70,14],[34,13,34,14],[36,13,36,14],[51,13,51,14],[37,13,37,14],[35,13,35,14],[46,13,46,14],[47,13,47,14],[48,13,48,14],[50,13,50,14],[41,13,41,14],[43,13,43,14],[60,13,60,14],[59,13,59,14],[63,13,63,14],[62,13,62,14],[42,13,42,14],[45,13,45,14],[78,5,78,6],[74,13,74,14],[75,13,75,14],[73,13,73,14],[76,11,76,12],[76,13,76,14],[72,13,72,14],[65,13,65,14],[69,13,69,14],[66,3,66,4],[69,3,69,4],[61,1,61,2],[44,13,44,14],[52,13,52,14],[56,13,56,14],[54,13,54,14],[55,13,55,14],[51,3,51,4],[57,3,57,4],[58,3,58,4],[53,3,53,4],[44,3,44,4],[49,13,49,14],[57,13,57,14],[58,13,58,14],[53,13,53,14],[34,3,34,4],[32,1,32,2],[31,8,31,9],[63,1,63,2],[41,3,41,4],[40,3,40,4],[39,1,39,2],[35,3,35,4],[56,1,56,2],[56,3,56,4],[54,3,54,4],[52,1,52,2],[51,1,51,2],[53,1,53,2],[55,1,55,2],[52,3,52,4],[59,3,59,4],[50,1,50,2],[31,0,31,1],[60,3,60,4],[63,3,63,4],[78,2,78,3],[75,1,75,2],[75,3,75,4],[72,3,72,4],[74,1,74,2],[74,3,74,4],[44,0,44,2],[40,1,40,2],[37,0,37,2],[43,3,43,4],[49,0,50,0],[43,0,43,2],[42,0,42,2],[71,3,71,4],[71,1,71,2],[49,1,49,2],[73,1,73,2],[73,3,73,4],[72,1,72,2],[70,1,70,2],[70,3,70,4],[68,3,68,4],[65,3,65,4],[64,3,64,4],[29,8,29,9],[28,5,28,9],[36,3,36,4],[30,8,30,9],[35,0,35,2],[36,0,36,2],[18,3,18,4],[37,3,37,4],[38,3,38,4],[34,0,34,2],[30,0,30,1],[24,0,24,1],[29,0,29,1],[27,0,27,1],[20,0,20,1],[22,0,22,1],[21,0,21,1],[23,0,23,1],[19,0,19,4],[21,2,22,4],[25,0,25,1],[38,1,38,2],[28,2,28,4],[26,0,26,1],[14,1,14,2],[17,0,17,1],[15,0,15,1],[15,5,15,6],[16,5,16,6],[17,5,17,6],[0,0,0,9],[13,1,13,2],[13,5,13,6],[14,5,14,6],[12,5,12,6],[9,0,9,2],[1,0,1,8],[10,1,10,2],[11,1,11,2],[10,7,11,7],[12,1,12,2],[15,3,15,4],[11,3,11,4],[16,3,17,4],[16,0,16,1],[14,3,14,4]]}
["Melding en berekening straatwerk,  2017",null,null,null,null,null,null,null,null,null,null,null,null,null,"                              2017_1"]
["volgens de Richtlijn Tarieven (graaf) werkzaamheden Telecom dd 12-03-2004.",null,null,null,null,null,null,null,null,null,null,null,"Datum:",{"$f":"NOW()","v":"2016-11-15T11:46:00.020"}]
["AANVRAGER:","……………………………….",null,null,"adres:","……………………………………………………………………",null,null,null,null,null,"Kontaktpersoon:",null,"………………….."]
["NAAM PROJECT:",null,null,null,null,null,null,null,null,null,null,"E-mail:","………………………………."]
["PLAATS:","…………………………………………………………………………………………………..",null,null,null,null,null,null,null,null,null,"telefoon:",null,"………………….."]
["GEMEENTE:",null,null,null,"adres:",{"$f":"IF($B$7>0.1,VLOOKUP(B7,'Gemeenten met categorie'!A3:F484,4),\"\")","v":"  Postbus 20, 6560 AA GROESBEEK"},null,null,null,null,null,"mobiel:",null,"………………….."]
[null,31,null,{"$f":"IF($B$7>0.1,VLOOKUP($B$7,'Gemeenten met categorie'!A2:D493,3),\"\")","v":1}]
["Uitvoering:"]
[null,1,null,null,null,null,null,null,null,null,null,null,null,"  "]
["Gemeentelijke gegevens:",null,null,"Verzamelde informatie:",null,null,null,"Task:","Discipline:",null,null,null,null,"bedrag:"]
["Kontaktpersoon gem.:","……………………….",null,"Inkoopordernr.:",null,"Projektnr:",null,"A","Herstel & onderhoud uitgevoerd door de wegbeheerder:",null,null,null,null,{"$f":"SUM(N35:N47)","v":0}]
["E-mail:","………………………",null,"………………",null,"……………."]
["telefoon:","………………………",null,"Datum opbreking:",null,"………………..",null,"B1","Herstel & onderhoud aanbieder",null,null,null,null,{"$f":"IF($B$9=2,(SUM($N$50:$N$61)),0)","v":0}]
["mobiel:","………………………",null,"Datum herstel:",null,"………………..",null,"B2","Herstel aanb. & onderh. wegbeh.",null,null,null,null,{"$f":"IF(($B$9=3),(SUM($N$50:$N$61)),0)","v":0}]
["Opdrachtnummer :","………………………",null,"Deellevering:",null,"………………..",null,"C","Herstel wegbeheerder voor al- gehele herbestrating",null,null,null,null,{"$f":"SUM(N64:N67)","v":0}]
["In te vullen gegevens:",null,null,"Laatste levering:",null,"……………….."]
["= Richtlijn tarief",null,null,"Uitvoerende aannemer:",null,"………………..",null,"D","Overige tarieven, herstel en onderhoud beheerder",null,null,null,null,{"$f":"SUM(N69:N76)","v":0}]
["= Af te spreken projektprijs",null,null,null,null,"…………………"]
[null,null,null,null,null,"…………………",null,"Totaal kosten:  ",null,null,null,null,null,{"$f":"SUM(N11:N18)","v":0}]
["OMSCHRIJVING STRAATWERK / BERMEN;"]
{"$rows_left_out":63}
{"sheet":"Gemeenten met categorie","index":1,"n_rows":502,"n_cols":38,"rows_kept":502,"cut":false,"hidden":false,"merged":[[114,4,114,6],[106,4,106,6],[120,4,120,6],[100,4,100,6],[68,11,68,12],[75,4,75,6],[76,4,76,6],[77,4,77,6],[81,4,81,6],[88,4,88,6],[94,4,94,6],[68,13,68,16],[155,4,155,6],[205,4,205,6],[193,4,193,6],[68,9,68,10],[73,7,73,8],[73,4,73,6],[74,7,74,8],[187,4,187,6],[75,7,75,8],[76,7,76,8],[77,7,77,8],[68,4,70,8],[149,4,149,6],[199,4,199,6],[74,4,74,6],[181,4,181,6],[175,4,175,6],[167,4,167,6],[126,4,126,6],[161,4,161,6],[143,4,143,6],[137,4,137,6],[132,4,132,6]]}
[null,"De Gemeenten van Nederland per 01-01-2016",null,null,null,null,null,null,"Verrekenings-categorie:",null,"Verrekening:",null,null,"Tarief:",null,"categorie:",1,2,3,4,5,null,null,null,null,null,"RICHTLIJN TARIEVEN 2004"]
[null,"Gemeente:","Indeling:",null,null,null,null,null,{"$f":"IF(AND(Rekenblad!$D$7=1,Rekenblad!$H$28>0.1,Rekenblad!$H$28<=15),(Q2),IF(AND(Rekenblad!$D$7=2,Rekenblad!$H$28>0.1,Rekenblad!$H$28<=15),(R2),(IF(AND(Rekenblad!$D$7=3,Rekenblad!$H$28>0.1,Rekenblad!$H$28<=15),(S2),IF(AND(Rekenblad!$D$7=4,Rekenblad!$H$28>0.1,Rekenblad!$H$28<=15),(T2),IF(AND(Rekenblad!$D$7=5,Rekenblad!$H$28>0.1,Rekenblad!$H$28<=15),(U2),0))))))","v":0},null,{"$f":"IF(AND(Rekenblad!$B$9=1,Rekenblad!$H$28>0,Rekenblad!$H$28<=15),(Rekenblad!$H$28),0)","v":0},null,null,"A.","Klinkers","<15m2",{"$f":"SUM($K82,$K83,$K86)","v":32.800000000000004},{"$f":"SUM($K82,$K89,$K92)","v":33.07},{"$f":"SUM($K82,$K95,$K98)","v":33.900000000000006},{"$f":"SUM($K82,$K101,$K104)","v":35.590000000000003},{"$f":"SUM($K82,$K107,$K110)","v":36.150000000000006}]
[1,"Aa en Hunze",1,"  Postbus 93,  9460 AB  GIETEN",null,null,null,null,{"$f":"IF(AND(Rekenblad!$D$7=1,Rekenblad!$H$28>15,Rekenblad!$H$28<=100),(Q3),IF(AND(Rekenblad!$D$7=2,Rekenblad!$H$28>15,Rekenblad!$H$28<=100),(R3),(IF(AND(Rekenblad!$D$7=3,Rekenblad!$H$28>15,Rekenblad!$H$28<=100),(S3),IF(AND(Rekenblad!$D$7=4,Rekenblad!$H$28>15,Rekenblad!$H$28<=100),(T3),IF(AND(Rekenblad!$D$7=5,Rekenblad!$H$28>15,Rekenblad!$H$28<=100),(U3),0))))))","v":0},null,{"$f":"IF(AND(Rekenblad!$B$9=1,Rekenblad!$H$28>15,Rekenblad!$H$28<=100),(Rekenblad!$H$28),0)","v":0},null,null,null,"Klinkers",">15m2",{"$f":"SUM($L82,$L83,$L86)","v":26.82},{"$f":"SUM($L82,$L89,$L92)","v":27.04},{"$f":"SUM($L82,$L95,$L98)","v":27.72},{"$f":"SUM($L82,$L101,$L104)","v":29.1},{"$f":"SUM($L82,$L107,$L110)","v":29.560000000000002},null,null,null,null,null,null,null,null,null,null,null,null,null,"KOSTENSPECIFICATIE",null,"   EURO ( € )"]
[2,"Aalburg",1,"  Postbus 40,  4260 AA  WIJK EN AALBURG",null,null,null,null,{"$f":"IF(AND(Rekenblad!$D$7=1,Rekenblad!$H$28>100),(Q4),IF(AND(Rekenblad!$D$7=2,Rekenblad!$H$28>100),(R4),(IF(AND(Rekenblad!$D$7=3,Rekenblad!$H$28>100),(S4),IF(AND(Rekenblad!$D$7=4,Rekenblad!$H$28>100),(T4),IF(AND(Rekenblad!$D$7=5,Rekenblad!$H$28>100),(U4),0))))))","v":0},null,{"$f":"IF(AND(Rekenblad!$B$9=1,Rekenblad!$H$28>100),(Rekenblad!$H$28),0)","v":0},null,null,null,"Klinkers",">100m2",{"$f":"SUM($M82,$M83,$M86)","v":23.820000000000004},{"$f":"SUM($M82,$M89,$M92)","v":24.020000000000003},{"$f":"SUM($M82,$M95,$M98)","v":24.620000000000005},{"$f":"SUM($M82,$M101,$M104)","v":25.850000000000005},{"$f":"SUM($M82,$M107,$M110)","v":26.26}]
[3,"Aalsmeer",2,"  Postbus 253, 1430 AG  AALSMEER",null,null,null,null,{"$f":"IF(AND(Rekenblad!$D$7=1,Rekenblad!$H$28>0.1,Rekenblad!$H$28<=15),(Q5),IF(AND(Rekenblad!$D$7=2,Rekenblad!$H$28>0.1,Rekenblad!$H$28<=15),(R5),(IF(AND(Rekenblad!$D$7=3,Rekenblad!$H$28>0.1,Rekenblad!$H$28<=15),(S5),IF(AND(Rekenblad!$D$7=4,Rekenblad!$H$28>0.1,Rekenblad!$H$28<=15),(T5),IF(AND(Rekenblad!$D$7=5,Rekenblad!$H$28>0.1,Rekenblad!$H$28<=15),(U5),0))))))","v":0},null,{"$f":"IF(AND(Rekenblad!$B$9=1,Rekenblad!$H$28>0,Rekenblad!$H$28<=15),(1),0)","v":0},null,null,null,"Klinkers","per reparatie",{"$f":"$K84","v":7.81},{"$f":"$K90","v":10.98},{"$f":"$K96","v":20.5},{"$f":"$K102","v":31.48},{"$f":"$K108","v":38.56},null,null,null,null,null,"1) UITVOERINGSKOSTEN"]
[4,"Aalten",1,"  Postbus 119,  7120 AC  AALTEN",null,null,null,null,{"$f":"IF(AND(Rekenblad!$D$7=1,Rekenblad!$H$28>0.1,Rekenblad!$H$28<=15),(Q6),IF(AND(Rekenblad!$D$7=2,Rekenblad!$H$28>0.1,Rekenblad!$H$28<=15),(R6),(IF(AND(Rekenblad!$D$7=3,Rekenblad!$H$28>0.1,Rekenblad!$H$28<=15),(S6),IF(AND(Rekenblad!$D$7=4,Rekenblad!$H$28>0.1,Rekenblad!$H$28<=15),(T6),IF(AND(Rekenblad!$D$7=5,Rekenblad!$H$28>0.1,Rekenblad!$H$28<=15),(U6),0))))))","v":0},null,{"$f":"IF(AND(Rekenblad!$B$9=1,Rekenblad!$H$28>0,Rekenblad!$H$28<15),(Rekenblad!$F$28),0)","v":0},null,null,null,"Degeneratie per m1","<15m2"]
[5,"Achterkarspelen",1,"  Postbus 2,  9285 ZV  BUITENPOST",null,null,null,null,{"$f":"IF(AND(Rekenblad!$D$7=1,Rekenblad!$H$28>15,Rekenblad!$H$28<=100),(Q7),IF(AND(Rekenblad!$D$7=2,Rekenblad!$H$28>15,Rekenblad!$H$28<=100),(R7),(IF(AND(Rekenblad!$D$7=3,Rekenblad!$H$28>15,Rekenblad!$H$28<=100),(S7),IF(AND(Rekenblad!$D$7=4,Rekenblad!$H$28>15,Rekenblad!$H$28<=100),(T7),IF(AND(Rekenblad!$D$7=5,Rekenblad!$H$28>15,Rekenblad!$H$28<=100),(U7),0))))))","v":0},null,{"$f":"IF(AND(Rekenblad!$B$9=1,Rekenblad!$H$28>15,Rekenblad!$H$28<=100),(Rekenblad!$F$28),0)","v":0},null,null,null,"Degeneratie per m1",">15m2",{"$f":"$L85","v":2.59},{"$f":"$L91","v":3.64},{"$f":"$L97","v":6.79},{"$f":"$L103","v":13.52},{"$f":"$L109","v":15.77},null,null,null,null,null,"a) Ploegkosten per 01-07-2003",null,null,null,null,"Per uur","  "]
[6,"Alblasserdam",5,"  Postbus 2,  2950 AA  ALBLASSERDAM",null,null,null,null,{"$f":"IF(AND(Rekenblad!$D$7=1,Rekenblad!$H$28>100),(Q8),IF(AND(Rekenblad!$D$7=2,Rekenblad!$H$28>100),(R8),(IF(AND(Rekenblad!$D$7=3,Rekenblad!$H$28>100),(S8),IF(AND(Rekenblad!$D$7=4,Rekenblad!$H$28>100),(T8),IF(AND(Rekenblad!$D$7=5,Rekenblad!$H$28>100),(U8),0))))))","v":0},null,{"$f":"IF(AND(Rekenblad!$B$9=1,Rekenblad!$H$28>=100),(Rekenblad!$F$28),0)","v":0},null,null,null,"Degeneratie per m1",">100m2",{"$f":"$M85","v":2.2999999999999998},{"$f":"$M91","v":3.24},{"$f":"$M97","v":6.03},{"$f":"$M103","v":12.01},{"$f":"$M109","v":14.01}]
[7,"Albrandswaard",2,"  Postbus 1000,  3160 GA  RHOON",null,null,null,null,{"$f":"IF(AND(Rekenblad!$D$7=1,Rekenblad!$E$28>0.1,Rekenblad!$E$28<=15),(Q9),IF(AND(Rekenblad!$D$7=2,Rekenblad!$E$28>0.1,Rekenblad!$E$28<=15),(R9),(IF(AND(Rekenblad!$D$7=3,Rekenblad!$E$28>0.1,Rekenblad!$E$28<=15),(S9),IF(AND(Rekenblad!$D$7=4,Rekenblad!$E$28>0.1,Rekenblad!$E$28<=15),(T9),IF(AND(Rekenblad!$D$7=5,Rekenblad!$E$28>0.1,Rekenblad!$E$28<=15),(U9),0))))))","v":0},null,{"$f":"IF(AND(Rekenblad!$B$9=1,Rekenblad!$E$28>0,Rekenblad!$E$28<=15),(Rekenblad!$E$28),0)","v":0},null,null,null,"Tegels","<15m2",{"$f":"SUM($N82,$N83,$N86)","v":25.46},{"$f":"SUM($N82,$N89,$N92)","v":25.630000000000003},{"$f":"SUM($N82,$N95,$N98)","v":26.16},{"$f":"SUM($N82,$N101,$N104)","v":27.37},{"$f":"SUM($N82,$N107,$N110)","v":27.77},null,null,null,null,null,"Straatmaker  I","groep D,  Elsevier GWW Kosten 1 juli 2003",null,null,null,{"$f":"Invoerscherm!E6","v":35.42},"(met 5% ziekteverzuim)"]
[8,"Alkmaar",1,"  Postbus 53,  1800 BC  ALKMAAR",null,null,null,null,{"$f":"IF(AND(Rekenblad!$D$7=1,Rekenblad!$E$28>15,Rekenblad!$E$28<=100),(Q10),IF(AND(Rekenblad!$D$7=2,Rekenblad!$E$28>15,Rekenblad!$E$28<=100),(R10),(IF(AND(Rekenblad!$D$7=3,Rekenblad!$E$28>15,Rekenblad!$E$28<=100),(S10),IF(AND(Rekenblad!$D$7=4,Rekenblad!$E$28>15,Rekenblad!$E$28<=100),(T10),IF(AND(Rekenblad!$D$7=5,Rekenblad!$E$28>15,Rekenblad!$E$28<=100),(U10),0))))))","v":0},null,{"$f":"IF(AND(Rekenblad!$B$9=1,Rekenblad!$E$28>15,Rekenblad!$E$28<=100),(Rekenblad!$E$28),0)","v":0},null,null,null,"Tegels",">15m2",{"$f":"SUM($O82,$O83,$O86)","v":19.61},{"$f":"SUM($O82,$O89,$O92)","v":19.739999999999998},{"$f":"SUM($O82,$O95,$O98)","v":20.149999999999999},{"$f":"SUM($O82,$O101,$O104)","v":21.08},{"$f":"SUM($O82,$O107,$O110)","v":21.39},null,null,null,null,null,"Straatmaker  II","groep B,  Idem",null,null,null,{"$f":"Invoerscherm!E7","v":33.68},"(met 5% ziekteverzuim)"]
[9,"Almelo",1,"  Postbus 5100,  7600 GC  ALMELO",null,null,null,null,{"$f":"IF(AND(Rekenblad!$D$7=1,Rekenblad!$E$28>100),(Q11),IF(AND(Rekenblad!$D$7=2,Rekenblad!$E$28>100),(R11),(IF(AND(Rekenblad!$D$7=3,Rekenblad!$E$28>100),(S11),IF(AND(Rekenblad!$D$7=4,Rekenblad!$E$28>100),(T11),IF(AND(Rekenblad!$D$7=5,Rekenblad!$E$28>100),(U11),0))))))","v":0},null,{"$f":"IF(AND(Rekenblad!$B$9=1,Rekenblad!$E$28>100),(Rekenblad!$E$28),0)","v":0},null,null,null,"Tegels",">100m2",{"$f":"SUM($P82,$P83,$P86)","v":18.419999999999998},{"$f":"SUM($P82,$P89,$P92)","v":18.549999999999997},{"$f":"SUM($P82,$P95,$P98)","v":18.929999999999996},{"$f":"SUM($P82,$P101,$P104)","v":19.809999999999999},{"$f":"SUM($P82,$P107,$P110)","v":20.099999999999998},null,null,null,null,null,"Transport","EVO-berekening  DD. 03-01-2002 + index",null,null,null,{"$f":"Invoerscherm!E8","v":9.2899999999999991},"incl.kraan","+",2.5000000000000001E-2,"ivm ontbreken EVO gegevens"]
[10,"Almere",3,"  Postbus  200,  1300 AE  ALMERE",null,null,null,null,{"$f":"IF(AND(Rekenblad!$D$7=1,Rekenblad!$E$28>0.1,Rekenblad!$E$28<=15),(Q12),IF(AND(Rekenblad!$D$7=2,Rekenblad!$E$28>0.1,Rekenblad!$E$28<=15),(R12),(IF(AND(Rekenblad!$D$7=3,Rekenblad!$E$28>0.1,Rekenblad!$E$28<=15),(S12),IF(AND(Rekenblad!$D$7=4,Rekenblad!$E$28>0.1,Rekenblad!$E$28<=15),(T12),IF(AND(Rekenblad!$D$7=5,Rekenblad!$E$28>0.1,Rekenblad!$E$28<=15),(U12),0))))))","v":0},null,{"$f":"IF(AND(Rekenblad!$B$9=1,Rekenblad!$E$28>0,Rekenblad!$E$28<=15),(1),0)","v":0},null,null,null,"Tegels","per reparatie",{"$f":"N84","v":0},{"$f":"$N90","v":0.77},{"$f":"$N96","v":3.09},{"$f":"$N102","v":8.89},{"$f":"$N108","v":10.83},null,null,null,null,null,null,null,null,null,null,"--------------------+",null,null,null,""]
[11,"Alphen aan de Rijn",5,"  Postbus 13,  2400 AA  ALPHEN AAN DE RIJN",null,null,null,null,{"$f":"IF(AND(Rekenblad!$D$7=1,Rekenblad!$H$28>0.1,Rekenblad!$H$28<=15),(Q13),IF(AND(Rekenblad!$D$7=2,Rekenblad!$H$28>0.1,Rekenblad!$H$28<=15),(R13),(IF(AND(Rekenblad!$D$7=3,Rekenblad!$H$28>0.1,Rekenblad!$H$28<=15),(S13),IF(AND(Rekenblad!$D$7=4,Rekenblad!$H$28>0.1,Rekenblad!$H$28<=15),(T13),IF(AND(Rekenblad!$D$7=5,Rekenblad!$H$28>0.1,Rekenblad!$H$28<=15),(U13),0))))))","v":0},null,{"$f":"IF(AND(Rekenblad!$B$9=1,Rekenblad!$E$28>0,Rekenblad!$E$28<=15),(Rekenblad!$C$28),0)","v":0},null,null,null,"Degeneratie per m1","<15m2",{"$f":"0*$G$18","v":0},{"$f":"0*$G18","v":0},{"$f":"0*$G18","v":0},{"$f":"0*$G18","v":0},{"$f":"0*$G18","v":0},null,null,null,null,null,null,null,null,null,null,{"$f":"SUM(AF9:AF11)","v":78.389999999999986}]
[12,"Alphen-Chaam",1,"  Postbus 3,  5130 AA  ALPHEN",null,null,null,null,{"$f":"IF(AND(Rekenblad!$D$7=1,Rekenblad!$E$28>15,Rekenblad!$E$28<=100),(Q14),IF(AND(Rekenblad!$D$7=2,Rekenblad!$E$28>15,Rekenblad!$E$28<=100),(R14),(IF(AND(Rekenblad!$D$7=3,Rekenblad!$E$28>15,Rekenblad!$E$28<=100),(S14),IF(AND(Rekenblad!$D$7=4,Rekenblad!$E$28>15,Rekenblad!$E$28<=100),(T14),IF(AND(Rekenblad!$D$7=5,Rekenblad!$E$28>15,Rekenblad!$E$28<=100),(U14),0))))))","v":0},null,{"$f":"IF(AND(Rekenblad!$B$9=1,Rekenblad!$E$28>15,Rekenblad!$E$28<=100),(Rekenblad!$C$28),0)","v":0},null,null,null,"Degeneratie per m1",">15m2",{"$f":"O85","v":0},{"$f":"$O91","v":0.15},{"$f":"$O97","v":0.6},{"$f":"$O103","v":7.29},{"$f":"$O109","v":9.5299999999999994},null,null,null,null,null,"Alg. kosten winst/risico aannemer",null,null,null,{"$f":"12/100","v":0.12},{"$f":"ROUND(AE14*AF13,2)","v":9.41}]
[13,"Ameland",1,"  Postbus 22,  9160 AA  HOLLUM",null,null,null,null,{"$f":"IF(AND(Rekenblad!$D$7=1,Rekenblad!$E$28>100),(Q15),IF(AND(Rekenblad!$D$7=2,Rekenblad!$E$28>100),(R15),(IF(AND(Rekenblad!$D$7=3,Rekenblad!$E$28>100),(S15),IF(AND(Rekenblad!$D$7=4,Rekenblad!$E$28>100),(T15),IF(AND(Rekenblad!$D$7=5,Rekenblad!$E$28>100),(U15),0))))))","v":0},null,{"$f":"IF(AND(Rekenblad!$B$9=1,Rekenblad!$E$28>100),(Rekenblad!$C$28),0)","v":0},null,null,null,"Degeneratie per m1",">100m2",{"$f":"0*$G$18","v":0},{"$f":"$P91","v":0.14000000000000001},{"$f":"$P97","v":0.56000000000000005},{"$f":"$P103","v":6.86},{"$f":"$P109","v":8.9499999999999993},null,null,null,null,null,null,null,null,null,null,"---------------------+"]
[14,"Amersfoort",1,"  Postbus 4000,  3800 EA  AMERSFOORT",null,null,null,null,null,null,null,null,null,null,null,null,null,null,null,null,null,null,null,null,null,null,null,null,null,"TOTAAL per ploeguur ",null,{"$f":"SUM(AF13:AF14)","v":87.799999999999983},"  TOTAAL per manuur ",null,{"$f":"ROUND(AF16/2,2)","v":43.9},"",null,""]
[15,"Amstelveen",5,"  Postbus 4,  1180 BA  AMSTELVEEN",null,null,null,null,null,null,null,null,null,"B1."]
[16,"Amsterdam",3,"  Postbus 202,  1000 AE  AMSTERDAM",null,null,null,null,{"$f":"IF(AND(Rekenblad!$D$7=1,Rekenblad!$H$28>0.1,Rekenblad!$H$28<=15),(Q18),IF(AND(Rekenblad!$D$7=2,Rekenblad!$H$28>0.1,Rekenblad!$H$28<=15),(R18),(IF(AND(Rekenblad!$D$7=3,Rekenblad!$H$28>0.1,Rekenblad!$H$28<=15),(S18),IF(AND(Rekenblad!$D$7=4,Rekenblad!$H$28>0.1,Rekenblad!$H$28<=15),(T18),IF(AND(Rekenblad!$D$7=5,Rekenblad!$H$28>0.1,Rekenblad!$H$28<=15),(U18),0))))))","v":0},null,{"$f":"IF(AND(Rekenblad!$B$9>=2,Rekenblad!$B$9<=3,Rekenblad!$H$28>0,Rekenblad!$H$28<=15),(1),0)","v":0},null,null,null,"Deg. klink. per m1","per reparatie",{"$f":"$P115","v":7.81},{"$f":"$P121","v":10.98},{"$f":"$P127","v":20.5},{"$f":"$P133","v":31.48},{"$f":"$P138","v":38.56}]
[17,"Apeldoorn",1,"  Postbus 9033,  7300 ES  APELDOORN",null,null,null,null,{"$f":"IF(AND(Rekenblad!$D$7=1,Rekenblad!$H$28>15),(Q19),IF(AND(Rekenblad!$D$7=2,Rekenblad!$H$28>15),(R19),(IF(AND(Rekenblad!$D$7=3,Rekenblad!$H$28>15),(S19),IF(AND(Rekenblad!$D$7=4,Rekenblad!$H$28>15),(T19),IF(AND(Rekenblad!$D$7=5,Rekenblad!$H$28>15),(U19),0))))))","v":0},null,{"$f":"IF(AND(Rekenblad!$B$9>=2,Rekenblad!$B$9<=3,Rekenblad!$H$28>15),(Rekenblad!$F$28),0)","v":0},null,null,null,"Deg. klink. per m1",">15m2",{"$f":"$P117","v":2.59},{"$f":"$P123","v":3.64},{"$f":"$P129","v":6.79},{"$f":"$P135","v":13.52},{"$f":"$P140","v":15.77},null,null,null,null,null,"b) kosten materiaal",null,null,"kosten   ","breuk","reparatie ","KLINKERS",null,null,"TEGELS"]
[18,"Appingedam",5,"  Postbus 15,  9900 AA  APPINGEDAM",null,null,null,null,{"$f":"IF(AND(Rekenblad!$D$7=1,Rekenblad!$E$28>0.1,Rekenblad!$E$28<=15),(Q20),IF(AND(Rekenblad!$D$7=2,Rekenblad!$E$28>0.1,Rekenblad!$E$28<=15),(R20),(IF(AND(Rekenblad!$D$7=3,Rekenblad!$E$28>0.1,Rekenblad!$E$28<=15),(S20),IF(AND(Rekenblad!$D$7=4,Rekenblad!$E$28>0.1,Rekenblad!$E$28<=15),(T20),IF(AND(Rekenblad!$D$7=5,Rekenblad!$E$28>0.1,Rekenblad!$E$28<=15),(U20),0))))))","v":0},null,{"$f":"IF(AND(Rekenblad!$B$9>=2,Rekenblad!$B$9<=3,Rekenblad!$E$28>0,Rekenblad!$E$28<=15),(1),0)","v":0},null,null,null,"Deg. tegels per m1","per reparatie",{"$f":"$P116","v":0},{"$f":"$P122","v":0.77},{"$f":"$P128","v":3.09},{"$f":"$P134","v":8.89},{"$f":"$P139","v":10.83},null,null,null,null,null,"Incl. Magazijntoeslag",{"$f":"15/100","v":0.15},null,"per m2","in %","per m2","materiaalverhouding per 1000",null,null,"materiaalverhouding per m2"]
{"$rows_left_out":483}
{"sheet":"Invoerscherm","index":2,"n_rows":32,"n_cols":7,"rows_kept":32,"cut":false,"hidden":false,"merged":[[3,3,3,4],[25,3,25,4],[1,2,1,6],[18,6,24,8]]}
[null,null,"Invoerscherm:"]
[null,null,"Gegevens uit: Uitgave Reed Business Informatie Bouw & Infra."]
[null,null,null,"bijgewerkt dd :","2016-11-11"]
[null,"Boekje: 1","GWW Kosten:","uurtarieven en loonkosten*"]
[null,null,null,"huidige tarief:","in te voeren:"]
[null,null,"Straatmaker groep D, inzittende werkbus:",{"$f":"'Gemeenten met categorie'!AF9","v":35.42},35.42]
[null,null,"Straatmaker groep B, inzittende werkbus:",{"$f":"'Gemeenten met categorie'!AF10","v":33.68},33.68]
[null,null,"Transport , EVO berekening",{"$f":"'Gemeenten met categorie'!AF11","v":9.2899999999999991},9.2899999999999991]
[]
[null,"Boekje 2:","GWW Kosten:","Funderingslagen en elementverhardingen"]
[null,null,null,"huidige tarief:","in te voeren:"]
[null,null,"Straatstenen, gebakken"]
[null,null,"Straatklinkers WF kwaliteit A4-12 tot en  met 5000 stuks",{"$f":"'Gemeenten met categorie'!AI22","v":357},357]
[null,null,"Straatklinkers KK 80 kwaliteit A4-12 tot en  met 5000 stuks",{"$f":"'Gemeenten met categorie'!AI23","v":550},550]
[]
[null,null,"Straatstenen, beton:"]
[null,null,"Betonstraatstenen KF, heide, 210 x 105 x 80 mm volle vracht",{"$f":"'Gemeenten met categorie'!AI24","v":239},239]
[]
[null,null,"Tegels beton:",null,null,"*","Bij een juiste invoer en acceptatie zijn de tarieven in de kolom: - huidige tarief en                                          - in te voeren                              gelijk !!!"]
[null,null,"Betontegels, 300 x 300 x 45mm komo, grijs",{"$f":"'Gemeenten met categorie'!AL22","v":8.0299999999999994},8.0299999999999994]
{"$rows_left_out":13}
{"sheet":"INFO","index":3,"n_rows":57,"n_cols":5,"rows_kept":57,"cut":false,"hidden":false,"merged":[]}
[]
[null,null,"Werking \"Rekenblad\":"]
[null,"-","Door de groene posities in te vullen vindt de verrekening plaats volgens de \"Richtlijn tarieven (graaf) werkzaamheden Telecom\"."]
[null,"-","Om de bomen, struiken en het asfalt te kunnen verrekenen kan een projektprijs worden afgesproken en ingevoerd."]
[null,"-","Door scrollen kan de gemeente worden ingesteld en daarna opgeslagen. Dus een éénmalige actie!"]
[null,"-","Tevens kan door scrollen de aard van de werkzaamheden worden ingesteld."]
[null,"-","Door beide scrollbeweging uit te voeren worden de bij u gemeente  behorende tarieven ingesteld."]
[]
[null,null,"Samenvatting:"]
[]
[null,null,"Dit \"Rekenblad\" is een uitgave van de Vereniging van Nederlandse Gemeenten en is gebaseerd op:"]
[null,null,"\"RICHTLIJN tarieven (graaf) werkzaamheden Telecom\", uitgegeven: 12 maart 2004. "]
[]
[null,null,"Richtlijn voor gemeenten en aanbieders van telecom diensten ten behoeve van het berekenen van tarieven voor herstel, onderhoud, beheer- en "]
[null,null,"degeneratiekosten bij (graaf)werkzaamheden door aanbieders, in openbare gronden die in eigendom of beheer zijn van gemeenten."]
[]
[null,"-","De Richtlijn bevat: ",null,"definities, rekenmethodiek en tarieven"]
[]
[null,"-","In de tarieven wordt geen onderscheid gemaakt tussen lasgaten en sleuven. Alle werkzaamheden worden berekend per vierkante meter."]
[null,null,"De degeneratie vergoeding wordt verrekend per strekkende meter."]
{"$rows_left_out":37}