{"text_format":"1","workbook":"xlsx","n_sheets":11,"sheets":["Invulinstructie ","Totaalblad","Overzicht gemeenten","Versiebeheer","begin","Gemeente x","einde","Categorie","Productcodes","Import Productcodes","sheet_name_check"],"not_rendered":{"charts":0,"images":1,"macros":1,"external_links":1,"defined_names":12,"comments":0,"pivot_tables":0},"unopened":[],"bounds":{"document_bytes":16777216,"sheet_cells":100000,"rows_first":2000,"rows_last":500,"rows_between":2000,"halvings":0,"cell_chars":16384,"cell_head_chars":4096},"cells_cut":0,"cells_raw":0,"read":"whole","date_system":"1900"}

{"sheet":"Invulinstructie ","index":0,"n_rows":32,"n_cols":2,"rows_kept":32,"cut":false,"hidden":false,"merged":[]}
[null,"Invulinstructie Financiële productieverantwoording Jeugdwet"]
[]
[null,"JEUGDWET INVULINSTRUCTIE "]
[]
[null,"Algemeen"]
[null,"Dit formulier is bedoeld voor de financiële verantwoording van zorgaanbieders uit hoofde van de Jeugdwet. De financiële productieverantwoording bevat de definitieve opgave van de gerealiseerde productie 2018 en is onlosmakelijk verbonden aan het “Algemeen accountantsprotocol financiële productieverantwoording WMO en Jeugdwet 2018 (en 2019)”. Zie verder het “Algemeen accountantsprotocol financiële productieverantwoording WMO en Jeugdwet 2018 (2019)”  (http://i-sociaaldomein.nl/).\n\nVoor zover in dit formulier wordt gesproken over ‘zorgaanbieder’ wordt hiermee bedoeld: alle onderdelen van een beherend rechtspersoon die samen opgenomen zijn in het gesloten contract met betreffende gemeente(n). Voor de definitie van 'gemeente' zie de definitielijst van het “Algemeen accountantsprotocol financiële productieverantwoording WMO en Jeugdwet 2018 (en 2019)”. \n\nEen boekjaar wordt gelijk gesteld aan het kalenderjaar. Wanneer sprake is van zorgtrajecten die niet per einde van het boekjaar kunnen worden afgesloten, geldt dat de financiële productieverantwoording tevens de financiële waarde van fictief afgesloten zorgtrajecten omvat die per 31 december 2018 onderhanden zijn. In de verantwoording van deze zorgtrajecten neemt u als productie mee de reeds in 2018 geleverde, maar nog niet afgesloten, ondersteuning en/of zorg. Dit doet u door bij ‘aantal’ het aantal gerealiseerde zorgtrajecten in te vullen, inclusief de som van de naar rato verleende zorg in nog niet afgesloten zorgtrajecten. Heeft u bijvoorbeeld 10 zorgtrajecten volledig afgerond en 9 half, dan verantwoordt u 14,5 trajecten. \n\nHet formulier moet van voor naar achteren en van boven naar beneden worden ingevuld. Alle door u in te vullen velden zijn ‘blauw gearceerd’. Witte cellen geven uitkomsten van berekeningen weer. \n\nHieronder wordt, indien van toepassing, per tabblad een toelichting gegeven. "]
[]
[null,"Tabblad ‘Totaalblad’"]
[null,"Het tabblad ‘Totaalblad’ geeft de totaal gerealiseerde productie uit hoofde van de Jeugdwet weer, waarvan gemeenten een accountantscontrole voorschrijven. "]
[]
[null,"Tabblad ‘Overzicht gemeenten’"]
[null,"In dit tabblad geeft u aan voor welke gemeente(n) u uw geleverde productie uit hoofde van de Jeugdwet wilt verantwoorden. Heeft u met een gemeente ook afspraken binnen het domein Wmo, dan gebruikt u daarvoor het verantwoordingsformat Wmo. In de financiële productieverantwoording op totaalniveau per domein wordt alleen de productie Jeugdwet verwerkt die betrekking heeft op de gemeenten die een accountantscontrole voorschrijven. De accountant waarmerkt dit overzicht en verwijst er naar in zijn controleverklaring (onderdeel “Overige aspecten – beperking in gebruik en verspreidingskring”). \n"]
[null,"Voor het aanmaken van de verantwoordingen per gemeente, vult u in het bovenste blok op regelniveau de gemeente(n) in waar u verantwoording over af wilt leggen. Vervolgens klikt u op de button ‘Aanmaken verantwoordingen gemeenten’. Het systeem maakt dan automatisch de tabbladen (voorzien van de naam van de gemeente) aan. Indien u meer regels nodig heeft, klikt u op ‘toevoegen’. Het systeem voegt een nieuwe regel toe onder de regel waar u staat met uw cursor. Dit maakt het mogelijk om ook tussen de reeds ingevoerde regels, nieuwe regels te plaatsen. Nadat u vervolgens de namen van de gemeente(n) heeft ingevuld, klikt u opnieuw op de button ‘Aanmaken verantwoordingen’. Het systeem voegt de nieuwe tabbladen voorzien van de naam van de gemeente toe. Heeft u per ongeluk een verkeerde gemeente opgenomen, dan kunt u deze verwijderen. Ga hiervoor op de betreffende regel staan en klik op de button ‘verwijderen’. Klik vervolgens opnieuw op de button ‘Aanmaken verantwoordingen gemeenten’ om ook het bijbehorende tabblad te verwijderen.   "]
[null," \nNa het aanmaken van de tabbladen is het niet gewenst om de volgorde van de tabbladen te wijzigen. Indien u toch wijzigingen aanbrengt, kunnen er fouten optreden in de automatische tellingen.\n\nOp basis van de ingevulde financiële productieverantwoordingen per gemeente berekent het model in het tabblad ‘Totaalblad’ de totale gerealiseerde productie binnen het domein Jeugdwet. \n\nDoor ondertekening van het formulier ‘Financiële productieverantwoording 2018’ verklaart de bestuurder van de zorgaanbieder dat de financiële productieverantwoording 2018 naar waarheid en in overeenstemming met de vigerende wet- en regelgeving is verantwoord. Zie hiervoor paragraaf 3.5 Normen- en toetsingskader, “Algemeen accountantsprotocol financiële productieverantwoording WMO en Jeugdwet 2018 (en 2019)”."]
[null,"Tabblad ‘Overzicht gemeenten’"]
[null,"In dit tabblad geeft u aan voor welke gemeente(n) u uw geleverde productie uit hoofde van de Jeugdwet wilt verantwoorden. Heeft u met een gemeente ook afspraken binnen het domein Wmo, dan gebruikt u daarvoor het verantwoordingsformat Wmo. In de financiële productieverantwoording op totaalniveau per domein wordt alleen de productie Jeugdwet verwerkt die betrekking heeft op de gemeenten die een accountantscontrole voorschrijven. De accountant waarmerkt dit overzicht en verwijst er naar in zijn controleverklaring (onderdeel “Overige aspecten – beperking in gebruik en verspreidingskring”). \n"]
[null,"Tabblad ‘Versiebeheer’"]
[null,"Als het formulier na publicatie nog is aangepast en er dus een nieuwe versie beschikbaar is, dan kunt u in het tabblad Versiebeheer zien welke mutaties er zijn doorgevoerd ten opzichte van het eerder gepubliceerde formulier. "]
[]
[null,"Tabblad ‘Gemeente’ "]
{"$rows_left_out":13}
{"sheet":"Totaalblad","index":1,"n_rows":48,"n_cols":14,"rows_kept":48,"cut":false,"hidden":false,"merged":[[0,11,0,12],[0,9,0,10],[5,1,5,2],[9,3,9,8],[4,10,4,14],[5,13,5,14],[6,1,6,2],[5,3,5,8],[6,3,6,8],[9,1,9,2],[8,4,8,8],[7,1,7,2],[8,1,8,2],[10,1,10,2],[7,3,7,8],[20,3,20,4],[10,3,10,8],[20,1,20,2],[31,10,40,14],[30,10,30,14],[19,5,19,7],[11,1,11,2],[11,3,11,8],[28,1,28,16],[27,1,27,4],[23,1,23,10],[25,1,26,14],[21,5,21,7],[20,5,20,7],[22,1,22,10],[32,1,39,8],[40,3,40,8],[31,3,31,8]]}
[null,"Financiële productieverantwoording Jeugdwet op totaalniveau",null,null,null,null,null,null,null,2018]
[]
[null,"Zorgaanbieder "]
[]
[null,"Zorgaanbieder",null,null,null,null,null,null,null,null,"Versiebeheer"]
[null,"Naam",null,null,null,null,null,null,null,null,"Versiedatum",null,null,{"$f":"LOOKUP(9.99999999999999E+307,Versiebeheer!B:B)","v":"2018-04-30"}]
[null,"Plaats"]
[null,"KvK-nummer"]
[null,"Contactpersoon"]
[null,"Telefoon"]
[null,"E-mail"]
[null,"AGB-code"]
[]
[]
[]
[]
[]
[]
[]
[null,"Financieringsstroom",null,null,null,"Gerealiseerde productie 2018"]
{"$rows_left_out":29}
{"sheet":"Overzicht gemeenten","index":2,"n_rows":44,"n_cols":14,"rows_kept":44,"cut":false,"hidden":false,"merged":[[10,2,10,9],[14,2,14,9],[13,2,13,9],[12,2,12,9],[9,2,9,9],[11,2,11,9],[34,10,43,14],[25,2,25,9],[33,10,33,14],[23,2,23,9],[15,2,15,9],[16,2,16,9],[22,2,22,9],[21,2,21,9],[17,2,17,9],[18,2,18,9],[19,2,19,9],[20,2,20,9]]}
[null,"Overzicht gemeenten waarop financiële productieverantwoording Jeugdwet op totaalniveau betrekking heeft"]
[]
[]
[]
[]
[]
[]
[]
[null,0,"Gemeente(n)"]
[null,1]
[null,2]
[null,3]
[null,4]
[null,5]
[null,6]
[null,7]
[null,8]
[null,9]
[null,10]
[null,11]
{"$rows_left_out":25}
{"sheet":"Versiebeheer","index":3,"n_rows":11,"n_cols":6,"rows_kept":11,"cut":false,"hidden":false,"merged":[]}
[]
[null,"Versiebeheer"]
[]
[null,"In onderstaande tabel ziet u welke mutaties er zijn ten opzichte van eerdere versies van het formulier Financiële productieverantwoording 2018."]
[null,"Hiermee kunt u bepalen of de gedane aanpassingen voor u van belang zijn. "]
[]
[null,"De eerste versie van het formulier is van:",null,null,"2018-04-30"]
[null,"De huidige versie van het formulier is van:",null,null,{"$f":"MAX(B11:B20)","v":"2018-04-30"}]
[]
[null,"Versie","Werkblad","Regel(s)","Foutmelding","Aanpassing"]
[null,{"$f":"E7","v":"2018-04-30"},null,null,null,"Uitleverversie 1.0"]

{"sheet":"begin","index":4,"n_rows":0,"n_cols":0,"rows_kept":0,"cut":false,"hidden":true,"merged":[]}

{"sheet":"Gemeente x","index":5,"n_rows":255,"n_cols":18,"rows_kept":255,"cut":false,"hidden":true,"merged":[[102,2,102,5],[238,2,246,10],[164,2,164,5],[165,2,165,5],[101,2,101,5],[109,2,109,5],[118,2,118,5],[125,2,125,5],[148,2,148,5],[149,2,149,5],[124,2,124,5],[108,2,108,5],[117,2,117,5],[141,2,141,5],[157,2,157,5],[222,2,222,9],[166,2,166,5],[172,2,172,5],[189,2,189,5],[190,2,190,5],[181,2,181,5],[227,2,235,10],[237,1,237,10],[205,2,205,5],[30,2,30,5],[36,2,36,5],[37,2,37,5],[76,2,76,5],[52,2,52,5],[45,2,45,5],[46,2,46,5],[85,2,85,5],[93,2,93,5],[77,2,77,5],[78,2,78,5],[62,2,62,5],[68,2,68,5],[69,2,69,5],[70,2,70,5],[61,2,61,5],[92,2,92,5],[183,2,183,5],[191,2,191,5],[238,1,246,1],[156,2,156,5],[150,2,150,5],[197,2,197,5],[198,2,198,5],[199,2,199,5],[207,2,207,5],[213,2,213,5],[214,2,214,5],[215,2,215,5],[173,2,173,5],[174,2,174,5],[206,2,206,5],[20,2,20,5],[21,2,21,5],[22,2,22,5],[28,2,28,5],[29,2,29,5],[8,3,8,6],[9,3,9,6],[10,3,10,6],[254,1,254,7],[142,2,142,5],[126,2,126,5],[134,2,134,5],[226,1,226,9],[227,1,235,1],[249,9,249,10],[133,2,133,5],[140,2,140,5],[180,2,180,5],[248,9,248,10],[182,2,182,5],[158,2,158,5],[250,9,250,10],[223,2,223,9],[224,2,224,9],[0,8,1,10],[94,2,94,5],[11,3,11,6],[132,2,132,5],[86,2,86,5],[18,3,18,5],[7,8,7,10],[100,2,100,5],[116,2,116,5],[8,1,8,2],[8,8,8,9],[9,8,9,9],[10,8,10,9],[11,8,11,9],[84,2,84,5],[38,2,38,5],[44,2,44,5],[53,2,53,5],[54,2,54,5],[60,2,60,5],[12,8,12,9],[110,2,110,5],[13,8,13,9],[14,8,14,9]]}
[null,"Financiële productieverantwoording Jeugdwet",null,null,null,null,null,null,{"$f":"\"Gemeente \"&D9","v":"Gemeente "},null,null,null,null,null,null,null,"wmo"]
[null,null,null,null,null,null,null,null,null,null,null,null,null,null,null,null,"jeugd",{"$f":"K223","v":0}]
[]
[null,"In dit onderdeel verantwoordt de zorgaanbieder de geleverde prestaties waarover de zorgaanbieder verantwoording af dient te leggen bij de gemeente: "]
[null,"geleverde prestaties met als grondslag de Jeugdwet. Alle aantallen worden op basis van de werkelijke realisatie ingevuld. "]
[]
[]
[null,"Gemeente ",null,null,null,null,null,null,"Zorgaanbieder"]
[null,"Naam",null,null,null,null,null,null,"Naam",null,{"$f":"Totaalblad!D6","v":0}]
[null,"Contactpersoon",null,null,null,null,null,null,"Plaats",null,{"$f":"Totaalblad!D7","v":0}]
[null,"Telefoon",null,null,null,null,null,null,"KvK-nummer",null,{"$f":"Totaalblad!D8","v":0}]
[null,"E-mail",null,null,null,null,null,null,"Contactpersoon Jeugdwet",null,{"$f":"IF(Totaalblad!E9=\"\",\"\",Totaalblad!E9)","v":""}]
[null,null,null,null,null,null,null,null,"Telefoon",null,{"$f":"IF(Totaalblad!D10=\"\",\"\",Totaalblad!D10)","v":""}]
[null,null,null,null,null,null,null,null,"E-mail",null,{"$f":"IF(Totaalblad!D11=\"\",\"\",Totaalblad!D11)","v":""}]
[null,null,null,null,null,null,null,null,"AGB-code",null,{"$f":"Totaalblad!D12","v":0}]
[]
[]
[null,"Geleverde prestaties Jeugdwet"]
[null,null,"Inkoop order nr: "]
[]
{"$rows_left_out":236}
{"sheet":"einde","index":6,"n_rows":0,"n_cols":0,"rows_kept":0,"cut":false,"hidden":true,"merged":[]}

{"sheet":"Categorie","index":7,"n_rows":192,"n_cols":2,"rows_kept":192,"cut":false,"hidden":true,"merged":[]}
["NR","Productcategorie"]
[31,"(2015) Zonder verblijf: uitgevoerd door wijk- of buurtteam"]
[32,"(2015) Zonder verblijf: ambulante jeugdhulp op locatie van de aanbieder"]
[33,"(2015) Zonder verblijf: daghulp op locatie van de aanbieder"]
[34,"(2015) Zonder verblijf: jeugdhulp in het netwerk van de jeugdige"]
[35,"(2015) Met verblijf: pleegzorg"]
[36,"(2015) Met verblijf: gezinsgericht"]
[37,"(2015) Met verblijf: gesloten plaatsing"]
[38,"(2015) Met verblijf: overig residentieel"]
[40,"Persoonlijke verzorging"]
[41,"Dagbehandeling"]
[42,"Vervoersdiensten"]
[43,"Jeugdhulp verblijf (incl. behandeling)"]
[44,"Jeugdhulp verblijf (excl. behandeling)"]
[45,"Jeugdhulp Ambulant"]
[46,"Jeugdhulp Crisis"]
[47,"Jeugdreclassering"]
[48,"Jeugdbescherming"]
[49,"Activiteiten in het preventief justitieel kader"]
[50,"Maatwerkarrangementen"]
{"$rows_left_out":173}
{"sheet":"Productcodes","index":8,"n_rows":609,"n_cols":3,"rows_kept":609,"cut":false,"hidden":false,"merged":[]}
["IJW 2.0","JZ21 - PRODUCTCODE","CODE"]
["Versie","2017-12-01"]
[null,"Betekenis","code"]
[40,"Persoonlijke verzorging"]
[null,"Persoonlijke verzorging specialistisch: outputgericht","40A01"]
[null,"Persoonlijke verzorging regulier: outputgericht","40A02"]
[null,"Persoonlijke verzorging specialistisch: inspanningsgericht","40A03"]
[null,"Persoonlijke verzorging regulier: inspanningsgericht","40A04"]
[null,"Persoonlijke verzorging regulier: outputgericht (licht)","40A05"]
[null,"Persoonlijke verzorging regulier: outputgericht (middel)","40A06"]
[null,"Persoonlijke verzorging regulier: outputgericht (zwaar)","40A07"]
[null,"Persoonlijke verzorging specialistisch: outputgericht (licht)","40A08"]
[null,"Persoonlijke verzorging specialistisch: outputgericht (middel)","40A09"]
[null,"Persoonlijke verzorging specialistisch: outputgericht (zwaar)","40A10"]
[null,"Persoonlijke verzorging regulier: inspanningsgericht (individueel)","40A11"]
[null,"Persoonlijke verzorging regulier: inspanningsgericht (op afstand)","40A12"]
[null,"Persoonlijke verzorging specialistisch: inspanningsgericht (individueel)","40A13"]
[null,"Persoonlijke verzorging specialistisch: inspanningsgericht (op afstand)","40A14"]
[null,"Persoonlijke verzorging laag tarief: inspanningsgericht","40A15"]
[41,"Dagbehandeling"]
{"$rows_left_out":590}
{"sheet":"Import Productcodes","index":9,"n_rows":592,"n_cols":4,"rows_kept":592,"cut":false,"hidden":false,"merged":[]}
["IMPORTPAGINA VOOR PRODUCTCODES PER GEMEENTE INCL. TARIEVEN"]
["betekenis (optioneel)","code","gemeente","prijs"]
["Persoonlijke verzorging specialistisch: outputgericht","40A01"]
["Persoonlijke verzorging regulier: outputgericht","40A02"]
["Persoonlijke verzorging specialistisch: inspanningsgericht","40A03"]
["Persoonlijke verzorging regulier: inspanningsgericht","40A04"]
["Persoonlijke verzorging regulier: outputgericht (licht)","40A05"]
["Persoonlijke verzorging regulier: outputgericht (middel)","40A06"]
["Persoonlijke verzorging regulier: outputgericht (zwaar)","40A07"]
["Persoonlijke verzorging specialistisch: outputgericht (licht)","40A08"]
["Persoonlijke verzorging specialistisch: outputgericht (middel)","40A09"]
["Persoonlijke verzorging specialistisch: outputgericht (zwaar)","40A10"]
["Persoonlijke verzorging regulier: inspanningsgericht (individueel)","40A11"]
["Persoonlijke verzorging regulier: inspanningsgericht (op afstand)","40A12"]
["Persoonlijke verzorging specialistisch: inspanningsgericht (individueel)","40A13"]
["Persoonlijke verzorging specialistisch: inspanningsgericht (op afstand)","40A14"]
["Persoonlijke verzorging laag tarief: inspanningsgericht","40A15"]
["Dagbehandeling regulier: outputgericht","41A01"]
["Dagbehandeling specialistisch: outputgericht","41A02"]
["Dagbehandeling regulier: inspanningsgericht","41A03"]
{"$rows_left_out":573}
{"sheet":"sheet_name_check","index":10,"n_rows":0,"n_cols":0,"rows_kept":0,"cut":false,"hidden":true,"merged":[]}